Home > Failed To > Ubt Error Failed To Produce Item

Ubt Error Failed To Produce Item

Contents

I also tried to re-run the command manually from the console with admin rights, didn't change anything (see my original post). Viewable by all users 0 Hi. However, I've been thinking about remaking the class as a blueprint and reparent the child classes. Follow this question Once you sign in you will be able to subscribe for any updates here Answers to this question build 4.8 github source code source Related Questions What is Source

Cheers Doug Wilson BouncingCzech Jul 20 '15 at 09:07 PM Thanks Doug, I'll keep trying and let you know the outcome. Let me know if you're still having problems as well as the answers to the following questions if you are. Separate the words with spaces (cat dog) to search cat,dog or both. asked 11 months ago viewed 1478 times active 10 months ago Related 1Code Signing Errors When Compiling C++ From Unreal Engine 4 in Xcode 5.10Unreal Engine 4.19 C++ Undeclared Identifier error, https://answers.unrealengine.com/questions/224133/480-p1-ubt-error-failed-to-produce-item.html

Ue4 Failed To Produce Dll

Then found "HaxeInit" line, then clicked "Recompile". BouncingCzech Jul 16 '15 at 02:26 PM No it doesn't actually run, I get a windows popup error: Unable to start program ..\QuickStar.Exe The system cannot find the file specified. Doug Wilson ♦♦ STAFF Jul 24 '15 at 03:05 PM Hey BouncingCzech- Have you had any luck in your test to build the project? These can be combined with each other.

  • waneck commented Dec 29, 2015 There are some steps on https://github.com/proletariatgames/UE4HaxeExternGenerator - but you'll need an empty project to get it to work.
  • add new comment (comments are locked) 10|2000 characters needed characters left ▼ Everyone Moderators Original poster and moderators Other...
  • Finding if two sets are equal Number sets symbols in LaTeX Player claims their wizard character knows everything (from books).
  • in the United States of America and elsewhere.
  • Please verify that you have sufficient rights to run this command. 1>Done Building Project "D:\Documents\Unreal Projects\VRShowRoom_4.8\Intermediate\ProjectFiles\VRShowRoom.vcxproj" (Rebuild target(s)) -- FAILED.
  • Have a great week! :D add new comment (comments are locked) 10|2000 characters needed characters left ▼ Everyone Moderators Original poster and moderators Other...
  • If you are following documentation that does not refer to Setup.bat, or asks you to download extra packages from somewhere and unzip them into the Engines folder do not do it
  • Not the answer you're looking for?
  • I switched to another drive with plenty of space for my project and it builds now!
  • Product Version: UE 4.9 Tags: log.txt (29.5 kB) more ▼ 6 total comments 427 characters / 69 words asked Mar 31 '16 at 03:11 PM in Packaging & Deployment Olverine 41

My problem is that I deleted an actor file from the project by mistake and now Visual Studio throws this error whenever I tried to build the solution. Epic, Epic Games, Unreal, Unreal Engine, UE4, and their logos are trademarks or registered trademarks of Epic Games, Inc. Separate the words with plus signs (cat +dog) to search for items that may contain cat but must contain dog. Error Ubt Error Failed To Produce Item Dll Deleting the saved and intermediate folders didn't help either.

Are assignments in the condition part of conditionals a bad practice? Failed To Produce Item Ue4 Olverine Mar 31 '16 at 10:22 PM I can build an empty project (or any other project) without problems. launching to wifi-connected android device fails Build Failed Unknown error Automation tool terminate LNK1104 When Packaging Project Web Browser causing build fail UE4 Build Error Windows Builds Failing Immediately [4.4.3] UAT https://answers.unrealengine.com/questions/248851/error-when-building-from-source-ubt-error-failed-t.html Then add an Application.ico file into the Windows folder, simply copy and paste it from another project.

I also found this forum post which is similar to the issue you're experiencing, if you're on Windows 7, I would suggest trying what's suggested on post 9 especially. Msb3075 Exited With Code 5 You may also want to try verifying the engine version through the launcher or using a different engine version to create the project. I'm pretty new to Unreal. I'm glad you found your own solution and thank you for bringing this to our attention as I'm sure the updated documentation will be very helpful to future users.

Failed To Produce Item Ue4

I just tried creating a project in C:\Unreal Test and I get the same error so it doesn't seem to be related to length of filepath. UnrealBuildTool Exception: ERROR: Directory 'C:\Users\will.masek\Dropbox\Unreal Projects\TestBPProject' is missing 'Source' folder. Ue4 Failed To Produce Dll I did first copy the project (except Binaries, Intermediate and Saved) then tried a in-place-conversation with the copy. Unreal Failed To Produce Item Can you attach the whole compilation log so we can try to figure out what is failing on 4.10 ?

spyro PS: Yes, it's 4.8.0 P1. http://centralpedia.com/failed-to/ubuntu-update-error-failed-to-fetch.html Viewable by all users 2 answers: sort voted first ▼ oldest newest voted first 0 Some things to try Fix the redirectors (right click contents -> Fix redirections) There is a If that doesn't help please list the steps you're taking when creating the project and where you run into the error. more ▼ 0 total comments 303 characters / 49 words answered Sep 05 '16 at 05:46 AM Mauricio N. Unreal Exited With Code 5 Please Verify That You Have Sufficient Rights To Run This Command

I have run GenerateProjectFiles.Bat and Setup.bat. Have a nice day, Matthew Clark add new comment (comments are locked) 10|2000 characters needed characters left ▼ Everyone Moderators Original poster and moderators Other... more ▼ 0 total comments 342 characters / 67 words answered < x UE4 AnswerHub Change Section Installation & Setup Using UE4 Rendering Packaging & Deployment Blueprint Scripting C++ Programming Legal have a peek here We recommend upgrading to the latest Safari, Google Chrome, or Firefox.

Santos 1 add new comment (comments are locked) 10|2000 characters needed characters left ▼ Everyone Moderators Original poster and moderators Other... Unreal Ubt Error share|improve this answer answered Dec 10 '15 at 16:35 Alexander S. 598 add a comment| Your Answer draft saved draft discarded Sign up or log in Sign up using Google I would try removing them temporarily to see if you can create a project.

add new comment (comments are locked) 10|2000 characters needed characters left ▼ Everyone Moderators Original poster and moderators Other...

These can be combined with each other. Follow this question Once you sign in you will be able to subscribe for any updates here Answers to this question 4.8 build failed conversion error Related Questions Error: This project Viewable by all users 1 answer: sort voted first ▼ oldest newest voted first 0 I'm going to put an answer up here and mark it as my solution, in case Command Line Argument Number 261 Does Not Match Precompiled Header Source Build is always breaking? [4.8] VR Preview broken mirroring, glitchy Unreal Engine 4 Kite Demo, Forest and Lake "UE4 engine has stopped working" every time I click build Change Mesh?

hope this helps. But yeah Blueprint projects seem to work OK... Disable most plug-ins Sometimes it's been reported that Blueprints can fail compiling if they have underscore in their files (I have not had that issue personally) Delete Binaries/Saved/Intermediate. Check This Out Got this error: 1>ERROR : UBT error : Failed to produce item: D:\Documents\Unreal Projects\VRShowRoom_4.8\Binaries\Win64\VRShowRoom.exe Total build time: 36,74 seconds 1>C:\Program Files (x86)\MSBuild\Microsoft.Cpp\v4.0\V120\Microsoft.MakeFile.Targets(43,5): error MSB3075: The command ""C:\Program Files\Epic Games\4.8\Engine\Build\BatchFiles\Rebuild.bat" VRShowRoom Win64

Examples cat dog --matches anything with cat,dog or both cat +dog --searches for cat +dog where dog is a mandatory term cat -dog -- searches for cat excluding any result containing Is that something that you have occurring in your project currently? BouncingCzech Jul 20 '15 at 09:09 PM Thanks Doug, I'll keep trying and let you know. You may have to register before you can post: click the register link above to proceed.

waneck commented Dec 29, 2015 Do you have more information? ALL RIGHTS RESERVED. But when it comes to create it, UE gives me an error: The project could not be compiled. PCH.MyProject.h.cpp E:\Program Files (x86)\Epic Games\4.10\Engine\Source\Runtime\Core\Public\HAL\PlatformIncludes.h(5): fatal error C1083: Cannot open include file: 'new': No such file or directory -------- End Detailed Actions Stats ----------------------------------------------------------- ERROR: UBT ERROR: Failed to produce item:

Does this occur if you try upgrading the project to 4.11 and packaging it there? Samantha Sutton ♦♦ STAFF May 07 '15 at 08:23 PM Hey Spyro, Yes, you're going to need to have the ICO file, it's necessary. Samantha Sutton ♦♦ STAFF May 02 '16 at 09:36 PM Your error isn't the same as the error shown above. First, could you please go to the Build/Windows folder inside of your project, if it's not there, simply create it.

Would you like to open it in Visual Studio?